تانسین
scope note: اروپا، بالای مونتین، زیر ایپرسین (ائوسن)
broader: پالئوسن فوقانی
preferred label: Thanetian @en
type: Concept

پالئوسن فوقانی
preferred label: upper Paleocene @en
type: Concept
narrower: تانسین