میوسن فوقانی
preferred label: upper Miocene @en
type: Concept
narrower: پونسین

پونسین
scope note: اروپا. بالای سارماسین، زیر پلیزانسین (پلیوسن)
broader: میوسن فوقانی
preferred label: Pontian @en
type: Concept