میوسن فوقانی
preferred label: upper Miocene @en
type: Concept
narrower: سارماسین

سارماسین
scope note: اروپا. از تقسیمات چینه نگاری اروپای مرکزی در دوران سوم که با میوسن میانی و فوقانی مطابقت دارد
broader: میوسن فوقانی
preferred label: Sarmatian @en
type: Concept