لوئیزین
scope note: آمریکای شمالی. میوسن میانی، بالای رلیزین و زیر موهنین.
broader: میوسن میانی
preferred label: Luisian @en
type: Concept

میوسن میانی
preferred label: middle Miocene @en
type: Concept
narrower: لوئیزین