پلیستوسن زیرین
preferred label: lower Pleistocene @en
type: Concept
narrower: نبراسکان

نبراسکان
scope note: مربوط به اولین اشکوب یخچالی عصر پلیستوسن در آمریکای شمالی.
broader: پلیستوسن زیرین
preferred label: Nebraskan @en
type: Concept