کرومرین
preferred label: Cromerian @en
type: Concept
narrower: یخچال شدگی جنوب لهستان

لهستان
preferred label: Poland @en
type: Concept
related: یخچال شدگی جنوب لهستان

یخچال شدگی جنوب لهستان
scope note: بیانگر یخچال شدگی در جنوب لهستان که تقریباً جنوبی ترین یخچالیهای پلیستوسن در مرکز اروپاست
related: لهستان
broader: کرومرین
preferred label: South Polish Glaciation @en
type: Concept