نقشه
preferred label: map @en
type: Concept
narrower: نقشه سنگ‌شناختی

نقشه سنگ‌شناختی
scope note: نوعی نقشۀ زمین‌شناختی که انواع سنگ‌های یک منطقۀ خاص را نشان می‌دهد
broader: نقشه
preferred label: lithologic map @en
type: Concept