پلیستوسن
preferred label: Pleistocene @en
type: Concept
narrower: میندل

السترین
preferred label: Elsterian @en
type: Concept
related: میندل

میندل
scope note: اروپا. بالای گونز و زیر رایس. از دوره های زمین شناسی بین یخچالی دارای خاکهای قرمز
related: السترین
broader: پلیستوسن
preferred label: Mindel @en
type: Concept