سنگ‌پوش ماه
scope note: لایۀ خاکستری نازکی در سطح ماه با عمق احتمالی چند متر که از مواد خردشدۀ کمابیش متراکم و سیمانی تشکیل شده است
related: ماه
related: خاک سطح ماه
preferred label: lunar regolith @en
type: Concept

خاک سطح ماه
preferred label: lunar soil @en
type: Concept
related: سنگ‌پوش ماه

ماه
preferred label: Moon @en
type: Concept
related: سنگ‌پوش ماه