سنگ نفوذی
alternative label: سنگ درونی
scope note: سنگ آذرینی که در سنگ‌های قدیمی‏تر از خود نفوذ کرده باشد
related: سنگ
related: سنگ آذرین
preferred label: intrusive rock @en
type: Concept

سنگ
preferred label: rock @en
type: Concept
related: سنگ نفوذی

سنگ آذرین
preferred label: igneous rock @en
type: Concept
related: سنگ نفوذی