خوشه‌سنگ
scope note: سنگ‌آهکی متشکل از انبوهه‌ای از گندله‌وارهای کربناتی یا ذرات دیگر که با جلبک‌ها یا آژند میکریتی به هم چسبیده‌اند
related: بافت
broader: سنگ رسوبی
preferred label: grapestone @en
type: Concept

سنگ رسوبی
preferred label: sedimentary rock @en
type: Concept
narrower: خوشه‌سنگ

بافت
preferred label: texture @en
type: Concept
related: خوشه‌سنگ