زغال‌سنگ
preferred label: coal @en
type: Concept
narrower: زغال‌سنگ پوده‌گلی

نوع سنگ
preferred label: lithotype @en
type: Concept
related: زغال‌سنگ پوده‌گلی

زغال‌سنگ پوده‌گلی
alternative label: زغال‌سنگ ساپروپلی
scope note: سنگ ساپروپلیتی، گل و لای ساپروپل داری که تحت تأثیر پدیده دیاژنز سخت و سفت شده است
related: نوع سنگ
broader: زغال‌سنگ
preferred label: sapropelite @en
type: Concept