سخت‌رویه گچی
scope note: نهشته‌ای گچی یا ژیپسی که سنگفرش صحرایی سیمانی‌شده را تشکیل می‌دهد
broader: سنگ رسوبی
preferred label: gypcrete @en
type: Concept

سنگ رسوبی
preferred label: sedimentary rock @en
type: Concept
narrower: سخت‌رویه گچی