سنگ آواری
preferred label: clastic rock @en
type: Concept
narrower: اسپاراگمیت

مواد خشکی
preferred label: terrigenous materials @en
type: Concept
related: اسپاراگمیت

اسپاراگمیت
scope note: نوعی ماسه‌سنگ که به تشکیلات پرکامبرین تعلق دارد و در سپراسکاندیناوی یافت می شود
related: مواد خشکی
broader: سنگ آواری
preferred label: sparagmite @en
type: Concept