سنگ آواری
preferred label: clastic rock @en
type: Concept
narrower: درآمیخته‌سنگ

درآمیخته‌سنگ
scope note: سنگ کنگلوِمرایی سخت‌شده‌ای که فاقد جورشدگی و دارای ماسه و ذرات نسبتاً درشت در خمیرۀ گِلی است
related: مواد خشکی
broader: سنگ آواری
preferred label: diamictite @en
type: Concept

مواد خشکی
preferred label: terrigenous materials @en
type: Concept
related: درآمیخته‌سنگ