سنگ‌ماسه کوارتزی
scope note: ماسه‌سنگی فاقد خمیره یا با خمیرۀ اندک که بیش از 95 درصد آن را کوارتز تشکیل می‌دهد
related: کوارتزیت رسوبی
broader: سنگ‌ماسه
preferred label: quartz arenite @en
type: Concept

کوارتزیت رسوبی
preferred label: orthoquartzite @en
type: Concept
related: سنگ‌ماسه کوارتزی

سنگ‌ماسه
preferred label: arenite @en
type: Concept
narrower: سنگ‌ماسه کوارتزی