ماسه‌سنگ
preferred label: sandstone @en
type: Concept
narrower: ماسه‌سنگ گِل‌خمیره‌ای

ماسه‌سنگ گِل‌خمیره‌ای
scope note: ماسه‌سنگ نابالغ با بیش از 15 درصد کانی رُسی
broader: ماسه‌سنگ
preferred label: graywacke @en
type: Concept