سنگ زیست‏شیمیایی
scope note: سنگ رسوبی که به‌طور مستقیم یا غیرمستقیم از فرایندهای شیمیایی و فعالیت‌های موجودات زنده به وجود آید
broader: سنگ رسوبی
preferred label: biochemical rock @en
type: Concept

سنگ رسوبی
preferred label: sedimentary rock @en
type: Concept
narrower: سنگ زیست‏شیمیایی