بسته‌سنگ
preferred label: boundstone @en
type: Concept
narrower: سنگ موج‌گیر

ریف
preferred label: reef @en
type: Concept
related: سنگ موج‌گیر

سنگ موج‌گیر
scope note: سنگ کربناتی برجایی که اجزای اولیۀ آن در هنگام نهشت با مواد آلی به هم چسبانده شده‌اند
related: ریف
broader: بسته‌سنگ
preferred label: bafflestone @en
type: Concept