سنگ‌آهک ماسه‌دانه
scope note: سنگ آهکی که بیش از 50 درصد آن از دانه‌های کربناتی هم‌اندازه با ماسه تشکیل شده است
related: بیوکالکارنیت
broader: سنگ آهک
preferred label: calcarenite @en
type: Concept

بیوکالکارنیت
preferred label: biocalcarenite @en
type: Concept
related: سنگ‌آهک ماسه‌دانه

سنگ آهک
preferred label: limestone @en
type: Concept
narrower: سنگ‌آهک ماسه‌دانه