سنگ آذرخش
scope note: از ماسه‌های گداخته یا سنگ‌ها توسط آذرخش تشکیل شده است.
broader: سنگ دگرگونی
preferred label: fulgurite @en
type: Concept

سنگ دگرگونی
preferred label: metamorphic rock @en
type: Concept
narrower: سنگ آذرخش