مرمر سرپنتین‌دار
scope note: آهک‌های دانه ریز با مرمرهای حفره‌ای و منقوط دار لکه‌ای با رگه‌های سرپنتین که اغلب به نسبت‌های مختلف دارای دولومی یا منیزیت می‌باشد
related: سنگ آهک
broader: مرمر
preferred label: ophicalcite @en
type: Concept

مرمر
preferred label: marble @en
type: Concept
narrower: مرمر سرپنتین‌دار

سنگ آهک
preferred label: limestone @en
type: Concept
related: مرمر سرپنتین‌دار