آذرآواری
preferred label: pyroclastic @en
type: Concept
narrower: توف آبزاد

توف آبزاد
alternative label: نهشتۀ شیشه‌آواری
scope note: نوعی سنگ آذرین پیروکلاستیک. سنگ‌های برشی دانه‌ریز که عناصر سازنده آن شیشه‌های آتشفشانی است و در گدازه‌های بالشی انباشته شده است.
broader: آذرآواری
preferred label: hyaloclastite @en
type: Concept