فوق مافیک
preferred label: ultramafic @en
type: Concept
narrower: گریکائیت

گریکائیت
scope note: ناحیه الماس‌دار در انکلاوهای موجود در کیمبرلیت‌ها را گویند.
broader: فوق مافیک
preferred label: griquaite @en
type: Concept