لابرادوریتیت
scope note: از سنگ‌های آذرین خروجی از تیپ آندزیتی به علت داشتن درصد کانی‌های آهن کم و منیزیم(لوکوکرات با رنگ خاکستری تیره)و تیپ بازالتی و به سبب داشتن پلاژیوکلاز.
broader: گابرو
preferred label: labradoritite @en
type: Concept

گابرو
preferred label: gabbro @en
type: Concept
narrower: لابرادوریتیت