گرانیت بیوتیتی
scope note: گرانیتی که در آن پس از سیلیس، کانی سیلیکاته غالب بلورهای درشت میکا است.
broader: گرانیت
preferred label: biotite granite @en
type: Concept

گرانیت
preferred label: granite @en
type: Concept
narrower: گرانیت بیوتیتی