سنگ تیره
scope note: سنگ آذرینی که شاخص رنگی آن بین 65 تا 95 درصد است
broader: سنگ آذرین
preferred label: melanocratic rock @en
type: Concept

سنگ آذرین
preferred label: igneous rock @en
type: Concept
narrower: سنگ تیره