سنگ روشن
scope note: سنگ آذرینی که شاخص رنگی آن بین 5 تا 35 درصد است
broader: سنگ آذرین
preferred label: leucocratic rock @en
type: Concept

سنگ آذرین
preferred label: igneous rock @en
type: Concept
narrower: سنگ روشن