سندی هوک
scope note: شبه‌جزیره‌ای در شمال شرق ناحیه مون ماوث شامل لبه جنوبی ورودی خلیج نیویورک سفلی است. همچنین در سان سالوادور، باهاما
related: سان سالوادور
preferred label: Sandy Hook @en
type: Concept

سان سالوادور
preferred label: San Salvador @en
type: Concept
related: سندی هوک