سکو
preferred label: platform @en
type: Concept
related: سکوی فرسایشی

فرسایش
preferred label: erosion @en
type: Concept
related: سکوی فرسایشی

سکوی فرسایشی
scope note: سطح نسبتاً تراز با گسترۀ محدودی که با فرسایش ساحلی شکل گرفته باشد
related: سکو
related: فرسایش
preferred label: erosion platform @en
type: Concept