سد رودپیچ
scope note: نهشته‌ای از شن و ماسه که در سمت درونی رودپیچ قراردارد
related: سد
related: رودپیچ
preferred label: meander bar @en
type: Concept

سد
preferred label: dam @en
type: Concept
related: سد رودپیچ

رودپیچ
preferred label: meander @en
type: Concept
related: سد رودپیچ