شکستگی
preferred label: fracture(structural geology) @en
type: Concept
related: سامانه شکستگی

سامانه شکستگی
scope note: دسته یا گروهی از شکستگی‌های هم‌سن حاصل از اعمال تنش
related: شکستگی
preferred label: fracture system @en
type: Concept