سیکلوتم
preferred label: cyclothem @en
type: Concept
narrower: بزرگ چرخه رسوبی

بزرگ چرخه رسوبی
scope note: ترکیبی از نهشته‌های تک‌چرخه‌ای مرتبط یا چرخه‌ای از نهشته‌های تک‌چرخه‌ای کوچک‌تر
broader: سیکلوتم
preferred label: megacyclothem @en
type: Concept