کند و پوش
scope note: روشی برای استخراج (استخراج کردن و پرکردن جای آن)
broader: ساخت لایه‌بندی صفحه‌ای
preferred label: cut and fill @en
type: Concept

ساخت لایه‌بندی صفحه‌ای
preferred label: planar bedding structure @en
type: Concept
narrower: کند و پوش