زیست‌آواری
scope note: ویژگی مواد آواری حاصل از اندام‌های مقاوم جانوران و گیاهان
related: زیست‌آوار
related: رسوب‌گذاری زیست‌آواری
preferred label: bioclastic @en
type: Concept

رسوب‌گذاری زیست‌آواری
preferred label: bioclastic sedimentation @en
type: Concept
related: زیست‌آواری

زیست‌آوار
preferred label: bioclast @en
type: Concept
related: زیست‌آواری