زهکشی
preferred label: drainage @en
type: Concept
narrower: زهکشی همساز

زهکشی همساز
scope note: زهکشی که هم‏جهت یا همخوان با ساختارهای زمین‏شناختی موجود شکل گرفته باشد
broader: زهکشی
preferred label: accordant drainage @en
type: Concept