هونشو
preferred label: Honshu @en
type: Concept
related: ریوجیما

ناگانو ژاپن
preferred label: Nagano Japan @en
type: Concept
related: ریوجیما

ریوجیما
scope note: جزیره‌ای در دریای ژاپن کناره شبه جزیره نوتو.
related: ناگانو ژاپن
related: هونشو
preferred label: Ryujima @en
type: Concept