شکستگی
preferred label: fracture(structural geology) @en
type: Concept
related: ریزشکستگی

ریزشکستگی
scope note: ترکی میکروسکوپی که می‌تواند قطع‌کنندۀ یک یا چند دانه باشد
related: شکستگی
preferred label: microfracture @en
type: Concept