رودخانه دون
scope note: از جنوب شرق تولا سرچشمه گرفته و در جهت جنوب شرقی به سوی یک پیچ بزرگ نزدیک رود ولگا جریان می یابد و سپس در جهت جنوب غربی به سوی دریای آزوو در روستوف جریان می یابد. ضمناً شاید در مکانهای دیگر واقع شده باشد.
related: فدراسیون روسیه
related: حوضه دون
preferred label: Don River @en
type: Concept

حوضه دون
preferred label: Don Basin @en
type: Concept
related: رودخانه دون

فدراسیون روسیه
preferred label: Russian Federation @en
type: Concept
related: رودخانه دون