ناحیه نی نوادا
preferred label: Nye County Nevada @en
type: Concept
related: رشته‌کوه گرانت

رشته‌کوه گرانت
scope note: در شمال شرق ناحیه نای، مرکز نوادا. ممکن است در جاهای دیگری واقع شده باشد.
related: ناحیه نی نوادا
related: نوادا
preferred label: Grant Range @en
type: Concept

نوادا
preferred label: Nevada @en
type: Concept
related: رشته‌کوه گرانت