رسوب
preferred label: sediment @en
type: Concept
related: رسوب‌نگار

رسوب‌نگار
scope note: دستگاهی که به‌طور مستقیم منحنی اندازۀ انباشتی رسوب را نشان می‌دهد
related: رسوب
preferred label: sedimentograph @en
type: Concept