رسوب
preferred label: sediment @en
type: Concept
related: رسوبش‌سنج

رسوبش‌سنج
scope note: وسیله‌ای برای اندازه‌گیری آهنگ ته‌نشینی ذرات ریز پراکنده در یک مایع
related: رسوب
preferred label: sedimentation balance @en
type: Concept