گل‌آوار
scope note: نوعی ذره آواری که معمولاً از فرسایش مواد گلی نرم به وجود می‌آید و پس از طی مسافتی کوتاه دوباره رسوب می‌کند
broader: رسوب آواری
preferred label: mudclast @en
type: Concept

رسوب آواری
preferred label: clastic sediment @en
type: Concept
narrower: گل‌آوار