رده بلوری
preferred label: crystal class @en
type: Concept
narrower: رده چهارگوش‌ ـ ذوزنقه‌وجهی

رده چهارگوش‌ ـ ذوزنقه‌وجهی
scope note: رده بلوری در سامانه چهارگوش با تقارن 2 2 4
broader: رده بلوری
preferred label: tetragonal-trapezohedral class @en
type: Concept