رده دوچهارگوش ـ ‌دوهرمی
scope note: ردۀ بلوری در سامانۀ چهارگوش با تقارن 4/0m 2/0m 2/0m
broader: رده بلوری
preferred label: ditetragonal-dipyramidal class @en
type: Concept

رده بلوری
preferred label: crystal class @en
type: Concept
narrower: رده دوچهارگوش ـ ‌دوهرمی