رده دوچهارگوش‌ ـ ‌هرمی
scope note: رده بلوری در سامانه چهارگوش با تقارن m m و4
broader: رده بلوری
preferred label: ditetragonal-pyramidal class @en
type: Concept

رده بلوری
preferred label: crystal class @en
type: Concept
narrower: رده دوچهارگوش‌ ـ ‌هرمی