رده بلوری
preferred label: crystal class @en
type: Concept
narrower: رده سه‌گوش ـ ‌ذوزنقه‌وجهی

رده سه‌گوش ـ ‌ذوزنقه‌وجهی
scope note: رده بلوری در بخش لوزوجهی سامانه شش‌گوش با تقارن 2 3
broader: رده بلوری
preferred label: trigonal-trapezohedral class @en
type: Concept