رده بلوری
preferred label: crystal class @en
type: Concept
narrower: رده شش‌گوش‌ ـ ذوزنقه‌وجهی

رده شش‌گوش‌ ـ ذوزنقه‌وجهی
scope note: رده بلوری در سامانه شش‌گوش با تقارن 2 2 6
broader: رده بلوری
preferred label: hexagonal-trapezohedral class @en
type: Concept