رخ انحلالی
scope note: رخی که با رگه‌های بازماندۀ انحلال‌ناپذیر یا سوگیری ترجیحی دانه‌های طویل یا ورقه‌های میکا مشخص می‌شود
broader: رخ
preferred label: solution cleavage @en
type: Concept

رخ
preferred label: cleavage @en
type: Concept
narrower: رخ انحلالی