رخ
preferred label: cleavage @en
type: Concept
narrower: رخ مدادی

رخ مدادی
scope note: رخی که باعث شکسته شدن سنگ به‌صورت قطعات دراز و کشیده، شبیه به مداد، می‌شود.
broader: رخ
preferred label: pencil cleavage @en
type: Concept